{"text_format":"1","workbook":"xlsx","n_sheets":9,"sheets":["ReadMe","Characteristics","1. Assumptions","2. Input_Data","3. Potential","4. Multipliers","5. Impact","6. Adjustment","7. Chart"],"not_rendered":{"charts":2,"images":0,"macros":1,"external_links":7,"defined_names":69,"comments":1,"pivot_tables":0},"unopened":[{"sheet":"7. Chart","index":8,"reason":"not_a_worksheet"}],"bounds":{"document_bytes":16777216,"sheet_cells":100000,"rows_first":2000,"rows_last":500,"rows_between":2000,"halvings":0,"cell_chars":16384,"cell_head_chars":4096},"cells_cut":0,"cells_raw":0,"read":"whole","date_system":"1900"}

{"sheet":"ReadMe","index":0,"n_rows":43,"n_cols":11,"rows_kept":43,"cut":false,"hidden":false,"merged":[[38,1,40,15],[15,1,18,15],[42,1,43,15],[6,0,9,15],[0,0,2,17]]}
["MCD Fiscal Multiplier Template "]
[]
[]
[]
["Instructions for using this template: "]
[]
["This template projects real GDP by “impacting” a baseline with fiscal measures (shocks). The template is based on a recent one developed by FAD, but is better tailored to the econometric work done in MCD and the specific needs of our department. Instructions on how to use the template are provided below."]
[]
[]
[]
[]
[null,null,"Cells Highlighted in orange indicate user inputs.  "]
[]
[null,"1)  Make sure that macros are enabled in excel."]
[]
[null,"2)  Set up basic assumptions on sheet 1 by selecting options from the drop down menus.  Required user inputs include: country name, current year, choice for real baseline GDP, country group, and multiplier persistence assumptions.  The recommended choice for baseline GDP is the trend of real GDP estimated using an HP filter, but if you prefer to use your own baseline GDP, please follow the instructions on sheet 3. "]
[]
[]
[]
[]
{"$rows_left_out":24}
{"sheet":"Characteristics","index":1,"n_rows":87,"n_cols":6,"rows_kept":87,"cut":false,"hidden":false,"merged":[]}
["Country Characteristics"]
["Countries","ISO Code","Ctry Code","Group","Oil Exporter?"]
["Afghanistan","AFG",512,"IMPOIL",{"$f":"IF(Codes[[#This Row],[Group]]=\"EXPOIL\",\"YES\",\"NO\")","v":"NO"}]
["Algeria","DZA",612,"EXPOIL",{"$f":"IF(Codes[[#This Row],[Group]]=\"EXPOIL\",\"YES\",\"NO\")","v":"YES"}]
["Armenia","ARM",911,"IMPOIL",{"$f":"IF(Codes[[#This Row],[Group]]=\"EXPOIL\",\"YES\",\"NO\")","v":"NO"}]
["Azerbaijan","AZE",912,"EXPOIL",{"$f":"IF(Codes[[#This Row],[Group]]=\"EXPOIL\",\"YES\",\"NO\")","v":"YES"}]
["Bahrain","BHR",419,"EXPOIL",{"$f":"IF(Codes[[#This Row],[Group]]=\"EXPOIL\",\"YES\",\"NO\")","v":"YES"}]
["Djibouti","DJI",611,"IMPOIL",{"$f":"IF(Codes[[#This Row],[Group]]=\"EXPOIL\",\"YES\",\"NO\")","v":"NO"}]
["Egypt","EGY",469,"IMPOIL",{"$f":"IF(Codes[[#This Row],[Group]]=\"EXPOIL\",\"YES\",\"NO\")","v":"NO"}]
["Georgia","GEO",915,"IMPOIL",{"$f":"IF(Codes[[#This Row],[Group]]=\"EXPOIL\",\"YES\",\"NO\")","v":"NO"}]
["Iran","IRN",429,"EXPOIL",{"$f":"IF(Codes[[#This Row],[Group]]=\"EXPOIL\",\"YES\",\"NO\")","v":"YES"}]
["Iraq","IRQ",433,"EXPOIL",{"$f":"IF(Codes[[#This Row],[Group]]=\"EXPOIL\",\"YES\",\"NO\")","v":"YES"}]
["Jordan","JOR",439,"IMPOIL",{"$f":"IF(Codes[[#This Row],[Group]]=\"EXPOIL\",\"YES\",\"NO\")","v":"NO"}]
["Kazakhstan","KAZ",916,"EXPOIL",{"$f":"IF(Codes[[#This Row],[Group]]=\"EXPOIL\",\"YES\",\"NO\")","v":"YES"}]
["Kuwait","KWT",443,"EXPOIL",{"$f":"IF(Codes[[#This Row],[Group]]=\"EXPOIL\",\"YES\",\"NO\")","v":"YES"}]
["Kyrgyz Republic","KGZ",917,"IMPOIL",{"$f":"IF(Codes[[#This Row],[Group]]=\"EXPOIL\",\"YES\",\"NO\")","v":"NO"}]
["Lebanon","LBN",446,"IMPOIL",{"$f":"IF(Codes[[#This Row],[Group]]=\"EXPOIL\",\"YES\",\"NO\")","v":"NO"}]
["Libya","LBY",672,"EXPOIL",{"$f":"IF(Codes[[#This Row],[Group]]=\"EXPOIL\",\"YES\",\"NO\")","v":"YES"}]
["Mauritania","MRT",682,"IMPOIL",{"$f":"IF(Codes[[#This Row],[Group]]=\"EXPOIL\",\"YES\",\"NO\")","v":"NO"}]
["Morocco","MAR",686,"IMPOIL",{"$f":"IF(Codes[[#This Row],[Group]]=\"EXPOIL\",\"YES\",\"NO\")","v":"NO"}]
{"$rows_left_out":68}
{"sheet":"1. Assumptions","index":2,"n_rows":39,"n_cols":9,"rows_kept":39,"cut":false,"hidden":false,"merged":[[36,1,36,2],[32,1,32,2],[22,3,25,8],[3,3,3,8],[7,3,9,8],[13,3,13,8],[14,3,14,8],[18,3,18,8],[20,3,20,8],[33,1,33,2],[34,1,34,2],[35,1,35,2]]}
[]
[null,"Basic Assumptions:"]
[]
[null,"Assumption:","Inputs:","Instructions:"]
[]
[null,"Country and Date:"]
[]
[null,"Country:","Egypt","Choose country from drop-down menu.  Enter the first year of your projection period."]
[null,"Country Code:",{"$f":"VLOOKUP($C$8,Codes[#All],3,FALSE)","v":469}]
[null,"Current Year:",2014]
[]
[null,"Data:"]
[]
[null,"Real Baseline GDP:","Potential GDP (HP Filter)","GDP variable used to compute the fiscal impact of measures."]
[null,"Oil Exporter:",{"$f":"VLOOKUP(C8,Codes[#All],5,FALSE)","v":"NO"},"Oil exporter updates automatically. "]
[]
[null,"Multiplier Assumptions:"]
[]
[null,"Country Group","MCD","Choose a country group."]
[]
{"$rows_left_out":20}
{"sheet":"2. Input_Data","index":3,"n_rows":31,"n_cols":28,"rows_kept":31,"cut":false,"hidden":false,"merged":[[0,0,0,1]]}
["Refresh this page to update MCD REO data. ",null,"EcDatabase","Series_Code","Country","Indicator.Descriptor","Indicator.Unit","Scale",{"$f":"J1-1","v":2000},2001,2002,2003,2004,2005,2006,2007,2008,2009,2010,2011,2012,2013,{"$f":"Current_Year","v":2014},{"$f":"W1+1","v":2015},{"$f":"X1+1","v":2016},{"$f":"Y1+1","v":2017},{"$f":"Z1+1","v":2018},{"$f":"AA1+1","v":2019}]
[]
["Fiscal Balance in Percent of GDP:"]
[]
["Unadjusted Balance","GGB_GDP.A","\\\\MCD\\REO\\MCDREO",{"$f":"cc&B5","v":"469GGB_GDP.A"},"Egypt","Overall fiscal balance, Gen govt, percent of GDP","Percent of GDP","Units",-1.2239030559409381,-2.2352941176470589,-11.347334389020849,-9.0243137724550895,-8.2535792293426749,-8.4064961741838449,-9.1807060427213862,-7.5474360896885067,-8.0040134003350083,-6.8962065495106497,-8.2840784021216649,-9.784027935813274,-10.516334687551787,-14.189602463925169,-12.421850069900364,-13.265447260127425,-13.679370102095998,-14.260520961388176,-14.118678355140734,-12.852501835038302]
["Balance Including Measures",null,null,null,null,null,null,null,null,null,null,null,null,null,null,null,null,null,null,null,null,null,{"$f":"W5+'1. Assumptions'!D39","v":-12.421850069900364},{"$f":"X5+'1. Assumptions'!E39","v":-10.765447260127425},{"$f":"Y5+'1. Assumptions'!F39","v":-11.679370102095998},{"$f":"Z5+'1. Assumptions'!G39","v":-13.260520961388176},{"$f":"AA5+'1. Assumptions'!H39","v":-14.118678355140734},{"$f":"AB5+'1. Assumptions'!I39","v":-12.852501835038302}]
[]
["Baseline Assumptions: "]
[]
["Real GDP",{"$f":"IF(Oil_X=\"YES\",\"NGDPXO_R.A\",\"NGDP_R.A\")","v":"NGDP_R.A"},"\\\\MCD\\REO\\MCDREO",{"$f":"cc&B10","v":"469NGDP_R.A"},"Egypt","Gross domestic product, constant prices, market prices","National currency","Billions",354.70269370460102,367.20272397094396,378.9,391,407,425.2,454.3,486.5,521.31531954887203,545.67951127819595,573.76691729323306,583.95676691729295,596.89003759398497,609.41246743346801,628.48306374635001,655.08681223547705,682.12344676637497,709.25618423181606,737.80327330139289,767.47278768067395]
["Nominal GDP",{"$f":"IF(Oil_X=\"YES\",\"NGDPXO.A\",\"NGDP.A\")","v":"NGDP.A"},"\\\\MCD\\REO\\MCDREO",{"$f":"cc&B11","v":"469NGDP.A"},"Egypt","Gross domestic product, current prices, market prices","National currency","Billions",340.1,358.7,378.9,417.5,485.3,538.5,617.70000000000005,744.8,895.5,1042.2,1206.5999999999999,1371,1575.5459000000001,1753.3,1991.4529667202401,2276.6577528082003,2621.3989627757901,3024.2278391724503,3494.4134339459501,4045.6830747060799]
["REO Potential Real GDP",{"$f":"IF(Oil_X=\"YES\",\"NPGDPXO_R.A\",\"NPGDP_R.A\")","v":"NPGDP_R.A"},"\\\\MCD\\REO\\MCDREO",{"$f":"cc&B12","v":"469NPGDP_R.A"},"Egypt","Potential real gross domestic product, constant prices in national currency","Billions of national currency","Billions",".",".",".",".",".",".",".",484.22314403513298,513.54966902692502,543.39135689992406,574.96808503751299,593.29292904404201,610.42034885319401,626.21506623537903,642.210747520636,661.21946179621307,683.33296863892895,708.95217035933501,737.65769715192198,767.45908293458501]
[]
["Baseline GDP",null,null,null,null,null,null,null,{"$f":"TRANSPOSE('3. Potential'!$H$10:$H$29)","v":{"$error":"#NAME?"}},{"$error":"#NAME?"},{"$error":"#NAME?"},{"$error":"#NAME?"},{"$error":"#NAME?"},{"$error":"#NAME?"},{"$error":"#NAME?"},{"$error":"#NAME?"},{"$error":"#NAME?"},{"$error":"#NAME?"},{"$error":"#NAME?"},{"$error":"#NAME?"},{"$error":"#NAME?"},{"$error":"#NAME?"},{"$error":"#NAME?"},{"$error":"#NAME?"},{"$error":"#NAME?"},{"$error":"#NAME?"},{"$error":"#NAME?"},{"$error":"#NAME?"}]
[]
["Real GDP Growth",null,null,null,null,null,null,null,{"$f":"IFERROR(100*((I10-H10)/H10),\".\")","v":"."},3.5240866472677714,3.1855090568395665,3.1934547373977362,4.0920716112531972,4.4717444717444685,6.8438381937911625,7.0878274268104748,7.1562835660579704,4.6735997995239877,5.1472348575531761,1.7759562841529599,2.2147651006711913,2.0979458611773674,3.1293413462966302,4.2330096105603365,4.1271834550653939,3.9776872638031411,4.0249334026598182,4.0213313565987727]
["Baseline Growth",null,null,null,null,null,null,null,{"$f":"IFERROR(100*((I14-H14)/H14),\".\")","v":"."},".",".",".",".",".",".",".",".",".",".",".",{"$f":"IFERROR(100*((U14-T14)/T14),\".\")","v":"."},".",".",".",".",".",".","."]
[]
["Fiscal Measures in National Currency:"]
[]
{"$rows_left_out":12}
{"sheet":"3. Potential","index":4,"n_rows":35,"n_cols":8,"rows_kept":35,"cut":false,"hidden":false,"merged":[[2,6,2,7],[32,0,33,12],[34,0,35,12]]}
[null,"Real GDP","Potential GDP (HP Filter)","Potential GDP (MCD REO)","Own (Enter on Sheet 3)"]
[]
[null,"Real GDP","Real Potential GDP *","MCD REO","Desk Input (OWN Baseline GDP)",null,"For Use in Analysis:"]
[]
[]
[]
["Indicator.Descriptor","Gross domestic product, constant prices, market prices"]
["Indicator.Unit","National currency"]
["Scale","Billions"]
[{"$f":"A11-1","v":2000},{"$f":"TRANSPOSE('2. Input_Data'!$I$10:$AB$10)","v":354.70269370460102},{"$f":"[7]!hp($B$10:$B$29,100)","v":{"$error":"#NAME?"}},{"$f":"TRANSPOSE('2. Input_Data'!$I$12:$AB$12)","v":"."},{"$f":"C10","v":{"$error":"#NAME?"}},null,{"$f":"A10","v":2000},{"$f":"HLOOKUP('1. Assumptions'!$C$14,'3. Potential'!$A$1:$E$29,MATCH(G10,'3. Potential'!$A$1:$A$29,0),FALSE)","v":{"$error":"#NAME?"}}]
[2001,367.20272397094396,{"$error":"#NAME?"},".",{"$f":"C11","v":{"$error":"#NAME?"}},null,{"$f":"A11","v":2001},{"$f":"HLOOKUP('1. Assumptions'!$C$14,'3. Potential'!$A$1:$E$29,MATCH(G11,'3. Potential'!$A$1:$A$29,0),FALSE)","v":{"$error":"#NAME?"}}]
[2002,378.9,{"$error":"#NAME?"},".",{"$error":"#NAME?"},null,2002,{"$f":"HLOOKUP('1. Assumptions'!$C$14,'3. Potential'!$A$1:$E$29,MATCH(G12,'3. Potential'!$A$1:$A$29,0),FALSE)","v":{"$error":"#NAME?"}}]
[2003,391,{"$error":"#NAME?"},".",{"$error":"#NAME?"},null,2003,{"$f":"HLOOKUP('1. Assumptions'!$C$14,'3. Potential'!$A$1:$E$29,MATCH(G13,'3. Potential'!$A$1:$A$29,0),FALSE)","v":{"$error":"#NAME?"}}]
[2004,407,{"$error":"#NAME?"},".",{"$error":"#NAME?"},null,2004,{"$f":"HLOOKUP('1. Assumptions'!$C$14,'3. Potential'!$A$1:$E$29,MATCH(G14,'3. Potential'!$A$1:$A$29,0),FALSE)","v":{"$error":"#NAME?"}}]
[2005,425.2,{"$error":"#NAME?"},".",{"$error":"#NAME?"},null,2005,{"$f":"HLOOKUP('1. Assumptions'!$C$14,'3. Potential'!$A$1:$E$29,MATCH(G15,'3. Potential'!$A$1:$A$29,0),FALSE)","v":{"$error":"#NAME?"}}]
[2006,454.3,{"$error":"#NAME?"},".",{"$error":"#NAME?"},null,2006,{"$f":"HLOOKUP('1. Assumptions'!$C$14,'3. Potential'!$A$1:$E$29,MATCH(G16,'3. Potential'!$A$1:$A$29,0),FALSE)","v":{"$error":"#NAME?"}}]
[2007,486.5,{"$error":"#NAME?"},484.22314403513298,{"$error":"#NAME?"},null,2007,{"$f":"HLOOKUP('1. Assumptions'!$C$14,'3. Potential'!$A$1:$E$29,MATCH(G17,'3. Potential'!$A$1:$A$29,0),FALSE)","v":{"$error":"#NAME?"}}]
[2008,521.31531954887203,{"$error":"#NAME?"},513.54966902692502,{"$error":"#NAME?"},null,2008,{"$f":"HLOOKUP('1. Assumptions'!$C$14,'3. Potential'!$A$1:$E$29,MATCH(G18,'3. Potential'!$A$1:$A$29,0),FALSE)","v":{"$error":"#NAME?"}}]
[2009,545.67951127819595,{"$error":"#NAME?"},543.39135689992406,{"$error":"#NAME?"},null,2009,{"$f":"HLOOKUP('1. Assumptions'!$C$14,'3. Potential'!$A$1:$E$29,MATCH(G19,'3. Potential'!$A$1:$A$29,0),FALSE)","v":{"$error":"#NAME?"}}]
[2010,573.76691729323306,{"$error":"#NAME?"},574.96808503751299,{"$error":"#NAME?"},null,2010,{"$f":"HLOOKUP('1. Assumptions'!$C$14,'3. Potential'!$A$1:$E$29,MATCH(G20,'3. Potential'!$A$1:$A$29,0),FALSE)","v":{"$error":"#NAME?"}}]
{"$rows_left_out":16}
{"sheet":"4. Multipliers","index":5,"n_rows":55,"n_cols":9,"rows_kept":55,"cut":false,"hidden":false,"merged":[[19,3,19,4],[49,3,49,8],[0,0,1,8]]}
[{"$f":"\"Multipliers for \"&'1. Assumptions'!C19&\" Country Group\"","v":"Multipliers for MCD Country Group"}]
[]
[]
[null,null,"This section displays panel estimated dynamic multipliers over a five year period. "]
[]
[]
[null,null,null,null,"Year 1","Year 2","Year 3","Year 4","Year 5"]
[null,null,null,"Government Consumption",{"$f":"VLOOKUP('1. Assumptions'!$C$19&\" - \"&'4. Multipliers'!$D8,Characteristics!$A$52:$F$87,MATCH('4. Multipliers'!E$7,Characteristics!$A$52:$F$52,0),FALSE)","v":0.26268954268420958},{"$f":"VLOOKUP('1. Assumptions'!$C$19&\" - \"&'4. Multipliers'!$D8,Characteristics!$A$52:$F$87,MATCH('4. Multipliers'!F$7,Characteristics!$A$52:$F$52,0),FALSE)","v":0.61859150374023553},{"$f":"VLOOKUP('1. Assumptions'!$C$19&\" - \"&'4. Multipliers'!$D8,Characteristics!$A$52:$F$87,MATCH('4. Multipliers'!G$7,Characteristics!$A$52:$F$52,0),FALSE)","v":0.74569934697453055},{"$f":"VLOOKUP('1. Assumptions'!$C$19&\" - \"&'4. Multipliers'!$D8,Characteristics!$A$52:$F$87,MATCH('4. Multipliers'!H$7,Characteristics!$A$52:$F$52,0),FALSE)","v":0.66096078481833387},{"$f":"VLOOKUP('1. Assumptions'!$C$19&\" - \"&'4. Multipliers'!$D8,Characteristics!$A$52:$F$87,MATCH('4. Multipliers'!I$7,Characteristics!$A$52:$F$52,0),FALSE)","v":0.49148366050594056}]
[null,null,null,"Subsidies and Transfers",{"$f":"VLOOKUP('1. Assumptions'!$C$19&\" - \"&'4. Multipliers'!$D9,Characteristics!$A$52:$F$87,MATCH('4. Multipliers'!E$7,Characteristics!$A$52:$F$52,0),FALSE)","v":0.13021576739958868},{"$f":"VLOOKUP('1. Assumptions'!$C$19&\" - \"&'4. Multipliers'!$D9,Characteristics!$A$52:$F$87,MATCH('4. Multipliers'!F$7,Characteristics!$A$52:$F$52,0),FALSE)","v":0.35344279722745503},{"$f":"VLOOKUP('1. Assumptions'!$C$19&\" - \"&'4. Multipliers'!$D9,Characteristics!$A$52:$F$87,MATCH('4. Multipliers'!G$7,Characteristics!$A$52:$F$52,0),FALSE)","v":0.48365856462704365},{"$f":"VLOOKUP('1. Assumptions'!$C$19&\" - \"&'4. Multipliers'!$D9,Characteristics!$A$52:$F$87,MATCH('4. Multipliers'!H$7,Characteristics!$A$52:$F$52,0),FALSE)","v":0.47125706296994002},{"$f":"VLOOKUP('1. Assumptions'!$C$19&\" - \"&'4. Multipliers'!$D9,Characteristics!$A$52:$F$87,MATCH('4. Multipliers'!I$7,Characteristics!$A$52:$F$52,0),FALSE)","v":0.3782458005416624}]
[null,null,null,"Capital Expenditure",{"$f":"VLOOKUP('1. Assumptions'!$C$19&\" - \"&'4. Multipliers'!$D10,Characteristics!$A$52:$F$87,MATCH('4. Multipliers'!E$7,Characteristics!$A$52:$F$52,0),FALSE)","v":0.65793803937140871},{"$f":"VLOOKUP('1. Assumptions'!$C$19&\" - \"&'4. Multipliers'!$D10,Characteristics!$A$52:$F$87,MATCH('4. Multipliers'!F$7,Characteristics!$A$52:$F$52,0),FALSE)","v":1.0766258826077597},{"$f":"VLOOKUP('1. Assumptions'!$C$19&\" - \"&'4. Multipliers'!$D10,Characteristics!$A$52:$F$87,MATCH('4. Multipliers'!G$7,Characteristics!$A$52:$F$52,0),FALSE)","v":1.0566883662631714},{"$f":"VLOOKUP('1. Assumptions'!$C$19&\" - \"&'4. Multipliers'!$D10,Characteristics!$A$52:$F$87,MATCH('4. Multipliers'!H$7,Characteristics!$A$52:$F$52,0),FALSE)","v":0.73768810474976132},{"$f":"VLOOKUP('1. Assumptions'!$C$19&\" - \"&'4. Multipliers'!$D10,Characteristics!$A$52:$F$87,MATCH('4. Multipliers'!I$7,Characteristics!$A$52:$F$52,0),FALSE)","v":0.40871908506405691}]
[null,null,null,"Tax Revenue",{"$f":"Characteristics!B86","v":-0.38927790739357426},{"$f":"Characteristics!C86","v":-0.31142232591485941},{"$f":"Characteristics!D86","v":-0.43376681109569698},{"$f":"Characteristics!E86","v":-0.30030009998932872},{"$f":"Characteristics!F86","v":-0.18907784073402176}]
[]
[]
[]
[]
[null,null,"This section computes the multipliers given user-defined persistence."]
[]
[null,null,null,{"$f":"\"Maximum Cumulative Multipliers \"","v":"Maximum Cumulative Multipliers "}]
[]
[]
{"$rows_left_out":36}
{"sheet":"5. Impact","index":6,"n_rows":57,"n_cols":9,"rows_kept":57,"cut":false,"hidden":false,"merged":[]}
[]
[null,"Impact on Output of Fiscal Measures"]
[]
[null,null,"Multipliers:"]
[]
[null,null,null,"Year 1","Year 2","Year 3","Year 4","Year 5"]
[null,null,"Government Consumption",{"$f":"IF('1. Assumptions'!$C$21=\"Panel Model Estimated\",'4. Multipliers'!E8,'4. Multipliers'!E52)","v":0.59655947757962446},{"$f":"IF('1. Assumptions'!$C$21=\"Panel Model Estimated\",'4. Multipliers'!F8,'4. Multipliers'!F52)","v":0.74569934697453055},{"$f":"IF('1. Assumptions'!$C$21=\"Panel Model Estimated\",'4. Multipliers'!G8,'4. Multipliers'!G52)","v":0.37284967348726528},{"$f":"IF('1. Assumptions'!$C$21=\"Panel Model Estimated\",'4. Multipliers'!H8,'4. Multipliers'!H52)","v":0},{"$f":"IF('1. Assumptions'!$C$21=\"Panel Model Estimated\",'4. Multipliers'!I8,'4. Multipliers'!I52)","v":0}]
[null,null,"Subsidies ",{"$f":"IF('1. Assumptions'!$C$21=\"Panel Model Estimated\",'4. Multipliers'!E9,'4. Multipliers'!E53)","v":0.38692685170163493},{"$f":"IF('1. Assumptions'!$C$21=\"Panel Model Estimated\",'4. Multipliers'!F9,'4. Multipliers'!F53)","v":0.48365856462704365},{"$f":"IF('1. Assumptions'!$C$21=\"Panel Model Estimated\",'4. Multipliers'!G9,'4. Multipliers'!G53)","v":0.24182928231352183},{"$f":"IF('1. Assumptions'!$C$21=\"Panel Model Estimated\",'4. Multipliers'!H9,'4. Multipliers'!H53)","v":0},{"$f":"IF('1. Assumptions'!$C$21=\"Panel Model Estimated\",'4. Multipliers'!I9,'4. Multipliers'!I53)","v":0}]
[null,null,"Capital Expenditure",{"$f":"IF('1. Assumptions'!$C$21=\"Panel Model Estimated\",'4. Multipliers'!E10,'4. Multipliers'!E54)","v":0.86130070608620779},{"$f":"IF('1. Assumptions'!$C$21=\"Panel Model Estimated\",'4. Multipliers'!F10,'4. Multipliers'!F54)","v":1.0766258826077597},{"$f":"IF('1. Assumptions'!$C$21=\"Panel Model Estimated\",'4. Multipliers'!G10,'4. Multipliers'!G54)","v":0.64597552956465576},{"$f":"IF('1. Assumptions'!$C$21=\"Panel Model Estimated\",'4. Multipliers'!H10,'4. Multipliers'!H54)","v":0.32298776478232788},{"$f":"IF('1. Assumptions'!$C$21=\"Panel Model Estimated\",'4. Multipliers'!I10,'4. Multipliers'!I54)","v":0}]
[null,null,"Tax Revenue",{"$f":"IF('1. Assumptions'!$C$21=\"Panel Model Estimated\",'4. Multipliers'!E11,'4. Multipliers'!E55)","v":-0.34701344887655761},{"$f":"IF('1. Assumptions'!$C$21=\"Panel Model Estimated\",'4. Multipliers'!F11,'4. Multipliers'!F55)","v":-0.43376681109569698},{"$f":"IF('1. Assumptions'!$C$21=\"Panel Model Estimated\",'4. Multipliers'!G11,'4. Multipliers'!G55)","v":-0.21688340554784849},{"$f":"IF('1. Assumptions'!$C$21=\"Panel Model Estimated\",'4. Multipliers'!H11,'4. Multipliers'!H55)","v":0},{"$f":"IF('1. Assumptions'!$C$21=\"Panel Model Estimated\",'4. Multipliers'!I11,'4. Multipliers'!I55)","v":0}]
[]
[]
[null,null,"Fiscal Measures:"]
[]
[null,null,null,{"$f":"Current_Year","v":2014},{"$f":"D15+1","v":2015},{"$f":"E15+1","v":2016},{"$f":"F15+1","v":2017},{"$f":"G15+1","v":2018},{"$f":"H15+1","v":2019}]
[null,null,"Government Consumption",{"$f":"'2. Input_Data'!W28","v":0},{"$f":"'2. Input_Data'!X28","v":0},{"$f":"'2. Input_Data'!Y28","v":0},{"$f":"'2. Input_Data'!Z28","v":0},{"$f":"'2. Input_Data'!AA28","v":0},{"$f":"'2. Input_Data'!AB28","v":0}]
[null,null,"Subsidies ",{"$f":"'2. Input_Data'!W29","v":0},{"$f":"'2. Input_Data'!X29","v":-9.8263021835321549},{"$f":"'2. Input_Data'!Y29","v":-6.82123446766375},{"$f":"'2. Input_Data'!Z29","v":-3.5462809211590804},{"$f":"'2. Input_Data'!AA29","v":0},{"$f":"'2. Input_Data'!AB29","v":0}]
[null,null,"Capital Expenditure",{"$f":"'2. Input_Data'!W30","v":0},{"$f":"'2. Input_Data'!X30","v":0},{"$f":"'2. Input_Data'!Y30","v":0},{"$f":"'2. Input_Data'!Z30","v":0},{"$f":"'2. Input_Data'!AA30","v":0},{"$f":"'2. Input_Data'!AB30","v":0}]
[null,null,"Tax Revenue",{"$f":"'2. Input_Data'!W31","v":0},{"$f":"'2. Input_Data'!X31","v":6.5508681223547711},{"$f":"'2. Input_Data'!Y31","v":6.82123446766375},{"$f":"'2. Input_Data'!Z31","v":3.5462809211590804},{"$f":"'2. Input_Data'!AA31","v":0},{"$f":"'2. Input_Data'!AB31","v":0}]
[]
{"$rows_left_out":38}
{"sheet":"6. Adjustment","index":7,"n_rows":24,"n_cols":10,"rows_kept":24,"cut":false,"hidden":false,"merged":[[15,3,15,9],[7,3,7,9],[1,1,1,9]]}
[]
[null,{"$f":"'1. Assumptions'!C8&\" - Analysis of Fiscal Measures on Output, \"&Current_Year-1&\"–\"&Current_Year+5","v":"Egypt - Analysis of Fiscal Measures on Output, 2013–2019"}]
[]
[]
[null,null,{"$f":"D5-1","v":2012},{"$f":"E5-1","v":2013},{"$f":"Current_Year","v":2014},{"$f":"E5+1","v":2015},{"$f":"F5+1","v":2016},{"$f":"G5+1","v":2017},{"$f":"H5+1","v":2018},{"$f":"I5+1","v":2019}]
[]
[]
[null,null,null,"(In Levels, unless Othewise Indicated)"]
[]
[null,"Real GDP",{"$f":"'2. Input_Data'!U10","v":596.89003759398497},{"$f":"'2. Input_Data'!V10","v":609.41246743346801},{"$f":"'2. Input_Data'!W10","v":628.48306374635001},{"$f":"'2. Input_Data'!X10","v":655.08681223547705},{"$f":"'2. Input_Data'!Y10","v":682.12344676637497},{"$f":"'2. Input_Data'!Z10","v":709.25618423181606},{"$f":"'2. Input_Data'!AA10","v":737.80327330139289},{"$f":"'2. Input_Data'!AB10","v":767.47278768067395}]
[null,"Baseline GDP",{"$f":"'2. Input_Data'!U14","v":{"$error":"#NAME?"}},{"$f":"'2. Input_Data'!V14","v":{"$error":"#NAME?"}},{"$f":"'2. Input_Data'!W14","v":{"$error":"#NAME?"}},{"$f":"'2. Input_Data'!X14","v":{"$error":"#NAME?"}},{"$f":"'2. Input_Data'!Y14","v":{"$error":"#NAME?"}},{"$f":"'2. Input_Data'!Z14","v":{"$error":"#NAME?"}},{"$f":"'2. Input_Data'!AA14","v":{"$error":"#NAME?"}},{"$f":"'2. Input_Data'!AB14","v":{"$error":"#NAME?"}}]
[null,"Total change in output relative to baseline from fiscal measures",null,null,{"$f":"'5. Impact'!D56","v":0},{"$f":"'5. Impact'!E56","v":-6.0752995080168262},{"$f":"'5. Impact'!F56","v":-12.600503260532491},{"$f":"'5. Impact'!G56","v":-12.657794272110046},{"$f":"'5. Impact'!H56","v":-6.3824349037074182},{"$f":"'5. Impact'!I56","v":-1.626724053256378}]
[null,"In Percent of GDP ",null,null,{"$f":"E12*100/E10","v":0},-0.92740372642901003,-1.8472467586718393,-1.7846575826222084,-0.86505917426313605,-0.21195853186826175]
[null,"Baseline GDP with the impact of discretionary fiscal measures",{"$f":"C11+C12","v":{"$error":"#NAME?"}},{"$f":"D11+D12","v":{"$error":"#NAME?"}},{"$f":"E11+E12","v":{"$error":"#NAME?"}},{"$error":"#NAME?"},{"$error":"#NAME?"},{"$error":"#NAME?"},{"$error":"#NAME?"},{"$error":"#NAME?"}]
[]
[null,null,null,"(Percent Change, unless Othewise Indicated)"]
[]
[null,"Real GDP",null,{"$f":"'2. Input_Data'!V16","v":2.0979458611773674},{"$f":"'2. Input_Data'!W16","v":3.1293413462966302},{"$f":"'2. Input_Data'!X16","v":4.2330096105603365},{"$f":"'2. Input_Data'!Y16","v":4.1271834550653939},{"$f":"'2. Input_Data'!Z16","v":3.9776872638031411},{"$f":"'2. Input_Data'!AA16","v":4.0249334026598182},{"$f":"'2. Input_Data'!AB16","v":4.0213313565987727}]
[null,"Baseline GDP",null,null,{"$f":"100*((E11-D11)/D11)","v":{"$error":"#NAME?"}},{"$error":"#NAME?"},{"$error":"#NAME?"},{"$error":"#NAME?"},{"$error":"#NAME?"},{"$error":"#NAME?"}]
[null,"Baseline GDP with the impact of discretionary fiscal measures",null,null,{"$f":"100*((E14-D14)/D14)","v":{"$error":"#NAME?"}},{"$f":"100*((F14-E14)/E14)","v":{"$error":"#NAME?"}},{"$error":"#NAME?"},{"$error":"#NAME?"},{"$error":"#NAME?"},{"$error":"#NAME?"}]
{"$rows_left_out":4}